{"text_format":"1","workbook":"xlsx","n_sheets":5,"sheets":["Instructions","Page1 - Expense Report","Page 2 - Travel Expenses","per diem tables","Cities"],"not_rendered":{"charts":0,"images":1,"macros":1,"external_links":3,"defined_names":26,"comments":0,"pivot_tables":0},"unopened":[],"bounds":{"document_bytes":16777216,"sheet_cells":100000,"rows_first":2000,"rows_last":500,"rows_between":2000,"halvings":0,"cell_chars":16384,"cell_head_chars":4096},"cells_cut":0,"cells_raw":0,"read":"whole","date_system":"1900"}

{"sheet":"Instructions","index":0,"n_rows":77,"n_cols":6,"rows_kept":77,"cut":false,"hidden":false,"merged":[[24,0,24,1],[23,2,23,12],[5,0,5,1],[11,0,11,1],[7,2,7,12],[15,2,15,12],[15,0,15,1],[17,0,17,1],[17,2,17,12],[21,2,21,12],[24,2,24,12],[21,0,21,1],[23,0,23,1],[0,0,0,3],[0,5,0,12],[9,0,9,1],[1,0,1,12],[19,2,19,12],[13,2,13,12],[19,0,19,1],[5,2,5,12],[7,0,7,1],[13,0,13,1],[9,2,9,12],[11,2,11,12],[2,5,2,12],[3,0,3,11],[79,0,79,12],[52,0,52,1],[76,2,76,11],[57,0,57,1],[55,0,55,12],[65,2,65,11],[67,2,67,11],[69,2,69,11],[63,2,63,11],[57,2,57,11],[61,2,61,11],[52,2,53,12],[59,2,59,11],[72,2,72,11],[74,2,74,11],[46,2,46,12],[50,2,50,12],[39,2,40,12],[71,2,71,11],[44,0,44,12],[46,0,46,1],[48,2,48,12],[48,0,48,1],[50,0,50,1],[41,2,41,12],[39,0,39,1],[37,0,37,12],[32,2,32,12],[35,2,35,12],[35,0,35,1],[33,2,33,12],[32,0,32,1],[33,0,33,1]]}
[null,null,null,null,null,"Travel Expense Statement - Instructions\n"]
["This form should be completed by any agency that is not using the Concur Travel and Expense Management System.  Use the Per Diem Calculator Tool (included with this form) to determine the total meal allowance due to the traveler (if applicable).\n"]
[]
["Section 1: Expense Submitter & Preparer Information"]
[]
["Agency & Traveler Name",null,"Enter the expense submitter's agency name and in the appropriate field enter the Traveler's name"]
[]
["Employee ID#",null,"Enter expense submitter's employee ID #"]
[]
["Home Address",null,"Enter the expense submitter's street address"]
[]
["City, State, Zip",null,"Enter the expense submitter's home city, state, and zip"]
[]
["Office Phone:",null,"Enter expense submitter's phone number"]
[]
["Email Address:",null,"Enter expense submitter's email address"]
[]
["Type of Travel:",null,"Select dropdown box for: In State, Out of State, or International Travel"]
[]
["Travel To Date:",null,"Enter first date of the trip"]
[]
["Travel From Date:",null,"Enter last date of trip"]
[]
["Departure & Return Time:",null,"Enter the time you left on the first day of your trip and the time you returned on the last day of your trip"]
["Section 2: Record of Expenses",null,"This section summarizes the Travel Expenses from page 2, the Mileage Expenses from page 3, and the M&IE Per diem amount calculated with the Per diem Calculator Tool on page 4."]
[]
["Date",null,"Write out the date in the MM/DD/YY format"]
[]
["Per Diem",null,"For the First and Last Day, check the box in the per diem field (Only 75% of Per Diem Eligible for Reimbursement on the First and Last Day "]
[null,null,"of an authorized trip.  Also, note that when a meal is provided the eligible reimbursable per diem is reduced by the amount allocated for that"]
[null,null,"particular meal at the 100% rate -- this is a State Policy)."]
[]
["Total Expenses",null,"The sum of the expenses in the Amount column will total here"]
["Travel Advance ",null,"If the expense submitter obtained a travel advance prior to the trip, enter the amount of the advance"]
[]
["Due TO/FROM the Expense Submitter",null,"If the expenses were greater than the total of the advances, the net amount owed TO the expense submitter will total here. If the advances were greater than the expense amount, the net amount due FROM the expense submitter will total here. If the expense submitter owes the State money, please attach a personal check to the expense report"]
[]
["Section 3: Certification and Attestation"]
[]
["Traveler Signature",null,"Enter the name of the traveler"]
[]
["Approver Signatures",null,"Note:  The individual/s below who approve the Travel and Expense Statement are certifying the following: \n           \n           *      Appropriateness of the expenditure and reasonableness of the amount            \n           *      Availability of funds            \n           *      Compliance with Statewide Travel Regulations          \n           *      Completeness of documentation and accuracy           "]
[]
[]
["Page 2  - Itemized Travel Expenses"]
[]
["Purpose of Trip/Event",null,"Clearly state the business purpose of the trip or event; include the conference name if applicable"]
[]
["Record of Travel Expenses",null,"Itemize all expenses by date and type. An original receipt is required for any item $25 or greater. Original receipts are also required for all lodging and airline expenses, regardless of amount."]
[]
["Common Carrier, Etc…",null,"Enter amount of any commercial transportation used during a trip (Receipts are required) Other expenses charged to this account include parking, taxes, and tolls"]
[]
["Miscellaneous Expenses",null,"Use this space to include expenses that do not apply to any of the above categories. List the date and provide a description of the expense.  Attach an additional sheet if necessary. "]
[]
[]
["Page 3 - Personal Vehicle Mileage"]
[]
["Traveler Name",null,"Enter the name of the employee: last name, first name, middle initial"]
[]
["Date",null,"Enter date of the traveler's departure"]
{"$rows_left_out":18}
{"sheet":"Page1 - Expense Report","index":1,"n_rows":47,"n_cols":21,"rows_kept":47,"cut":false,"hidden":false,"merged":[[1,0,1,12],[11,0,11,12],[2,9,2,10],[4,3,4,7],[5,3,5,7],[9,3,9,7],[7,3,7,7],[6,3,6,7],[8,3,8,7],[3,11,3,12],[8,11,8,12],[7,11,7,12],[4,11,4,12],[5,11,5,12],[9,11,9,12],[34,2,34,4],[6,11,6,12],[0,0,0,6],[18,4,18,5],[15,4,15,5],[16,4,16,5],[16,0,16,3],[17,0,17,3],[14,0,14,3],[16,6,16,7],[17,4,17,5],[15,0,15,3],[14,6,14,7],[15,6,15,7],[18,0,18,3],[0,7,0,12],[45,0,45,11],[35,0,35,11],[40,0,40,11],[42,0,42,11],[44,0,44,11],[43,0,43,11],[38,0,38,12],[37,0,37,12],[41,0,41,11],[39,0,39,11],[32,0,32,11],[33,0,33,11],[25,4,25,5],[31,0,31,11],[29,0,29,6],[25,0,25,3],[25,6,25,7],[13,8,13,12],[13,0,13,7],[21,0,21,3],[21,4,21,5],[14,4,14,5],[19,0,19,3],[20,0,20,3],[19,4,19,5],[20,4,20,5],[18,6,18,7],[19,6,19,7],[17,6,17,7],[21,6,21,7],[20,6,20,7],[22,0,22,3],[23,0,23,3],[24,0,24,3],[24,6,24,7],[22,4,22,5],[24,4,24,5],[22,6,22,7],[23,6,23,7],[23,4,23,5]]}
[null,null,null,null,null,null,null,"DOMESTIC"]
["Section 1: Expense Submitter and Personal Information"]
[]
["Agency:",null,null,"Savannah State University",null,null,null,null,null,"Type of Travel",null,null,null,null,null,null,null,null,null,null,"In State"]
["Traveler's Name:",null,null,null,null,null,null,null,null,"From Date: MM/DD/YY",null,null,null,null,null,null,null,null,null,null,"Out of State"]
["Employee ID #:",null,null,null,null,null,null,null,null,"To Date: MM/DD/YY",null,null,null,null,null,null,null,null,null,null,"International"]
["Home Address:",null,null,null,null,null,null,null,null,"Departure Time:"]
["City, State, Zip:",null,null,null,null,null,null,null,null,"Return Time:"]
["Office Phone:",null,null,null,null,null,null,null,null,"Travel Destination:",null,"City,State"]
["Email Address:",null,null,null,null,null,null,null,null,"If Other, Specify"]
[]
["Section 2: Record of Expenses"]
["Daily Per Diem:",{"$f":"VLOOKUP(L9,Table1[#All],6,FALSE)","v":"SSU Meals"},null,null,"In-State: $50.00, High Cost Areas $50.00 (Cobb, DeKalb, Fulton, Glynn, and Richmond Counties);                                                                   For Out-of-State Per Diems, refer to www.gsa.gov, and deduct Incidentals ($5.00/Day)"]
[" þ First & Last Day, Please Check Box in Per Diem Column",null,null,null,null,null,null,null,"þ For Provided Meals, Please Check Box"]
["Date: (Ex: 10/01/2012)",null,null,null,"Per Diem ",null,"Location",null,"Breakfast","Lunch","Dinner","Lodging","Amount",null,"Per Diem","Is Blank A17","B","L","D"]
[{"$f":"IF(ISBLANK(L5),\"\",SUM(L5))","v":""},null,null,null,{"$f":"IF(COUNTBLANK(A16),\"\",IF(O16=TRUE,$B$13*0.75,$B$13))","v":""},null,{"$f":"IF(COUNTBLANK(A16)=1,\"\",IF(ISBLANK($B$13),\"\",IF($B$13=0,\"\",$L$9)))","v":""},null,{"$f":"IF($E$16=\"\",\"\",IF(Q16=TRUE,SUM(VLOOKUP($E$16,'per diem tables'!$A$2:$D$27,2,FALSE)*-1),\"\"))","v":""},{"$f":"IF($E$16=\"\",\"\",IF(R16=TRUE,SUM(VLOOKUP($E$16,'per diem tables'!$A$2:$D$27,3,FALSE)*-1),\"\"))","v":""},{"$f":"IF($E$16=\"\",\"\",IF(S16=TRUE,SUM(VLOOKUP($E$16,'per diem tables'!$A$2:$D$27,4,FALSE)*-1),\"\"))","v":""},null,{"$f":"IF(COUNTBLANK(E16),\"\",E16+SUM(I16:K16)+L16)","v":""},null,false,{"$f":"ISBLANK(A16)","v":false},false,false,false]
[{"$f":"IF(A16<$L$6,A16+1,\"\")","v":""},null,null,null,{"$f":"IF(COUNTBLANK(A17),\"\",IF(O17=TRUE,$B$13*0.75,$B$13))","v":""},null,"",null,{"$f":"IF($E$16=\"\",\"\",IF(Q17=TRUE,SUM(VLOOKUP($E$17,'per diem tables'!$A$2:$D$27,2,FALSE)*-1),\"\"))","v":""},{"$f":"IF($E$16=\"\",\"\",IF(R17=TRUE,SUM(VLOOKUP($E$17,'per diem tables'!$A$2:$D$27,3,FALSE)*-1),\"\"))","v":""},{"$f":"IF($E$16=\"\",\"\",IF(S17=TRUE,SUM(VLOOKUP($E$17,'per diem tables'!$A$2:$D$27,4,FALSE)*-1),\"\"))","v":""},null,{"$f":"IF(COUNTBLANK(E17),\"\",E17+SUM(I17:K17)+L17)","v":""},null,false,{"$f":"ISBLANK(A17)","v":false},false,false,false]
[{"$f":"IF(A17<$L$6,A17+1,\"\")","v":""},null,null,null,"",null,"",null,{"$f":"IF($E$16=\"\",\"\",IF(Q18=TRUE,SUM(VLOOKUP($E$18,'per diem tables'!$A$2:$D$27,2,FALSE)*-1),\"\"))","v":""},{"$f":"IF($E$16=\"\",\"\",IF(R18=TRUE,SUM(VLOOKUP($E$18,'per diem tables'!$A$2:$D$27,3,FALSE)*-1),\"\"))","v":""},{"$f":"IF($E$16=\"\",\"\",IF(S18=TRUE,SUM(VLOOKUP($E$18,'per diem tables'!$A$2:$D$27,4,FALSE)*-1),\"\"))","v":""},null,"",null,false,false,false,false,false]
["",null,null,null,"",null,"",null,{"$f":"IF($E$16=\"\",\"\",IF(Q19=TRUE,SUM(VLOOKUP($E$19,'per diem tables'!$A$2:$D$27,2,FALSE)*-1),\"\"))","v":""},{"$f":"IF($E$16=\"\",\"\",IF(R19=TRUE,SUM(VLOOKUP($E$19,'per diem tables'!$A$2:$D$27,3,FALSE)*-1),\"\"))","v":""},{"$f":"IF($E$16=\"\",\"\",IF(S19=TRUE,SUM(VLOOKUP($E$19,'per diem tables'!$A$2:$D$27,4,FALSE)*-1),\"\"))","v":""},null,"",null,false,false,false,false,false]
["",null,null,null,{"$f":"IF(COUNTBLANK(A20),\"\",IF(O20=TRUE,$B$13*0.75,$B$13))","v":""},null,"",null,{"$f":"IF($E$16=\"\",\"\",IF(Q20=TRUE,SUM(VLOOKUP($E$20,'per diem tables'!$A$2:$D$27,2,FALSE)*-1),\"\"))","v":""},{"$f":"IF($E$16=\"\",\"\",IF(R20=TRUE,SUM(VLOOKUP($E$20,'per diem tables'!$A$2:$D$27,3,FALSE)*-1),\"\"))","v":""},{"$f":"IF($E$16=\"\",\"\",IF(S20=TRUE,SUM(VLOOKUP($E$20,'per diem tables'!$A$2:$D$27,4,FALSE)*-1),\"\"))","v":""},null,"",null,false,false,false,false,false]
["",null,null,null,"",null,"",null,{"$f":"IF($E$16=\"\",\"\",IF(Q21=TRUE,SUM(VLOOKUP($E$21,'per diem tables'!$A$2:$D$27,2,FALSE)*-1),\"\"))","v":""},{"$f":"IF($E$16=\"\",\"\",IF(R21=TRUE,SUM(VLOOKUP($E$21,'per diem tables'!$A$2:$D$27,3,FALSE)*-1),\"\"))","v":""},{"$f":"IF($E$16=\"\",\"\",IF(S21=TRUE,SUM(VLOOKUP($E$21,'per diem tables'!$A$2:$D$27,4,FALSE)*-1),\"\"))","v":""},null,"",null,false,false,false,false,false]
["",null,null,null,"",null,"",null,{"$f":"IF($E$16=\"\",\"\",IF(Q22=TRUE,SUM(VLOOKUP($E$22,'per diem tables'!$A$2:$D$27,2,FALSE)*-1),\"\"))","v":""},{"$f":"IF($E$16=\"\",\"\",IF(R22=TRUE,SUM(VLOOKUP($E$22,'per diem tables'!$A$2:$D$27,3,FALSE)*-1),\"\"))","v":""},{"$f":"IF($E$16=\"\",\"\",IF(S22=TRUE,SUM(VLOOKUP($E$22,'per diem tables'!$A$2:$D$27,4,FALSE)*-1),\"\"))","v":""},null,"",null,false,false,false,false,false]
["",null,null,null,"",null,"",null,{"$f":"IF($E$16=\"\",\"\",IF(Q23=TRUE,SUM(VLOOKUP($E$23,'per diem tables'!$A$2:$D$27,2,FALSE)*-1),\"\"))","v":""},{"$f":"IF($E$16=\"\",\"\",IF(R23=TRUE,SUM(VLOOKUP($E$23,'per diem tables'!$A$2:$D$27,3,FALSE)*-1),\"\"))","v":""},{"$f":"IF($E$16=\"\",\"\",IF(S23=TRUE,SUM(VLOOKUP($E$23,'per diem tables'!$A$2:$D$27,4,FALSE)*-1),\"\"))","v":""},null,"",null,false,false,false,false,false]
["",null,null,null,"",null,"",null,{"$f":"IF($E$16=\"\",\"\",IF(Q24=TRUE,SUM(VLOOKUP($E$24,'per diem tables'!$A$2:$D$27,2,FALSE)*-1),\"\"))","v":""},{"$f":"IF($E$16=\"\",\"\",IF(R24=TRUE,SUM(VLOOKUP($E$24,'per diem tables'!$A$2:$D$27,3,FALSE)*-1),\"\"))","v":""},{"$f":"IF($E$16=\"\",\"\",IF(S24=TRUE,SUM(VLOOKUP($E$24,'per diem tables'!$A$2:$D$27,4,FALSE)*-1),\"\"))","v":""},null,"",null,false,false,false,false,false]
["",null,null,null,"",null,"",null,{"$f":"IF($E$16=\"\",\"\",IF(Q25=TRUE,SUM(VLOOKUP($E$25,'per diem tables'!$A$2:$D$27,2,FALSE)*-1),\"\"))","v":""},{"$f":"IF($E$16=\"\",\"\",IF(R25=TRUE,SUM(VLOOKUP($E$25,'per diem tables'!$A$2:$D$27,3,FALSE)*-1),\"\"))","v":""},{"$f":"IF($E$16=\"\",\"\",IF(S25=TRUE,SUM(VLOOKUP($E$25,'per diem tables'!$A$2:$D$27,4,FALSE)*-1),\"\"))","v":""},null,"",null,false,false,false,false,false]
["",null,null,null,"",null,"",null,{"$f":"IF($E$16=\"\",\"\",IF(Q26=TRUE,SUM(VLOOKUP($E$26,'per diem tables'!$A$2:$D$27,2,FALSE)*-1),\"\"))","v":""},{"$f":"IF($E$16=\"\",\"\",IF(R26=TRUE,SUM(VLOOKUP($E$26,'per diem tables'!$A$2:$D$27,3,FALSE)*-1),\"\"))","v":""},{"$f":"IF($E$16=\"\",\"\",IF(S26=TRUE,SUM(VLOOKUP($E$26,'per diem tables'!$A$2:$D$27,4,FALSE)*-1),\"\"))","v":""},null,"",null,false,false,false,false,false]
["Explain Any Unusual Amounts for Subsistence:",null,null,null,null,null,null,"Amount by Column",{"$f":"SUM(I16:I26)","v":0},{"$f":"SUM(J16:J26)","v":0},0,0]
[null,null,null,null,null,null,null,null,null,null,null,"TOTAL",{"$f":"SUM(M16:M27)","v":0}]
[]
["State Use Miles:      Tier 1                                Tier 2",null,null,null,null,null,null,"Rate",{"$f":"IF(O30=TRUE,0.67,IF(P30=TRUE,0.21,\"\"))","v":""},"Total Miles",{"$f":"'Page 2 - Travel Expenses'!I23","v":0},null,{"$f":"IF(COUNTBLANK(I30),\"\",I30*K30)","v":""},null,false,false]
["If personal vehicle is used after Car Cost Comparison determines Rental Vehicle is cheaper, Tier 2 rate will be reimbursed"]
["Common Carrier / Limousine / Taxi / Uber / etc. (Explain in Section on Page 2)",null,null,null,null,null,null,null,null,null,null,null,{"$f":"'Page 2 - Travel Expenses'!I40","v":0}]
["Miscellaneous Expenses (Explain in Section on Page 2)",null,null,null,null,null,null,null,null,null,null,null,{"$f":"'Page 2 - Travel Expenses'!I47","v":0}]
["TOTAL TRAVEL EXPENSE",null,null,null,null,null,null,null,null,null,null,null,{"$f":"SUM(M28:M33)","v":0}]
["Only if Applicable:  ",null,null,null,null,"← Enter Cash Advance Voucher #",null,null,null,null,null,"Enter Advance Amount →"]
["Due TO/FROM Expense Submitter:",null,null,null,null,null,null,null,null,null,null,null,{"$f":"M34-M35","v":0}]
[]
["Section 3: Certification and Attestation"]
["I do solemnly swear, under criminal penalty of a felony for false statements subject to punishment by fine of not more than $1,000 or by imprisonment of not less than one nor more than five years, that the above statements are true and I have incurred the described expenses and the state use mileage in the discharge of my official duties of the state.\""]
[]
["Traveler Signature:",null,null,null,null,null,null,null,null,null,null,null,"Date"]
[]
["Supervisor Signature",null,null,null,null,null,null,null,null,null,null,null,"Date"]
[]
["Budget Unit Head Signature:",null,null,null,null,null,null,null,null,null,null,null,"Date"]
[]
["Title III Signature (if applicable):",null,null,null,null,null,null,null,null,null,null,null,"Date"]

{"sheet":"Page 2 - Travel Expenses","index":2,"n_rows":49,"n_cols":22,"rows_kept":49,"cut":false,"hidden":false,"merged":[[0,0,0,1],[0,2,0,3],[1,0,1,3],[3,1,3,2],[6,6,7,6],[6,0,7,0],[6,1,7,1],[6,2,7,2],[3,3,3,4],[5,2,5,4],[46,0,46,7],[28,0,28,8],[29,0,29,8],[33,1,33,7],[31,1,32,7],[39,0,39,7],[41,1,41,7],[37,1,37,7],[38,1,38,7],[40,1,40,7],[36,1,36,7],[31,8,32,8],[30,0,30,8],[25,0,25,1],[44,1,44,7],[45,1,45,7],[31,0,32,0],[6,7,7,7],[27,0,27,8],[42,1,42,7],[43,1,43,7],[35,1,35,7],[34,1,34,7],[6,3,6,4],[6,8,7,8]]}
[null,null,null,null,null,"Itemized Travel Expenses"]
[]
[]
["Traveler Name:",{"$f":"'Page1 - Expense Report'!D5","v":0},null,"GA License Plate Number:",null,null,null,null,null,null,null,null,null,null,null,null,null,null,null,"YES",null,"Automobile"]
[]
[null,null,"Select type of personal vehicle:",null,null,"Automobile"]
["Date","Origin","Destination","Odometer Readings (Optional)",null,null,"Commute Miles","Personal Miles","State Use Miles"]
[null,null,null,"Starting ","Ending","Total Miles"]
[null,null,null,null,null,{"$f":"E9-D9","v":0},null,null,{"$f":"+F9-G9-H9","v":0}]
[null,null,null,null,null,0,null,null,{"$f":"+F10-G10-H10","v":0}]
[null,null,null,null,null,0,null,null,0]
[null,null,null,null,null,0,null,null,0]
[null,null,null,null,null,0,null,null,0]
[null,null,null,null,null,0,null,null,0]
[null,null,null,null,null,0,null,null,0]
[null,null,null,null,null,0,null,null,0]
[null,null,null,null,null,0,null,null,0]
[null,null,null,null,null,0,null,null,0]
[null,null,null,null,null,0,null,null,0]
[null,null,null,null,null,0,null,null,0]
[null,null,null,null,null,0,null,null,0]
[null,null,null,null,null,0,null,null,0]
["Indicate use of motor pool vehicle or shared transportation:",null,null,null,null,null,"Total State Use Miles",null,{"$f":"SUM(I9:I22)","v":0}]
[]
["        Motor Pool Vehicle was used for travel"]
["Person(s) traveled with: "]
[]
["Purpose of the Trip:"]
[]
[]
["All reimbursable expenses must be listed and appropriate original receipts attached. "]
["Date","Commercial Transportation (Including Parking, Taxi, Tolls)",null,null,null,null,null,null,"Amount"]
[]
[]
[]
[]
[]
[]
[]
["TOTAL COMMON CARRIER, ETC…",null,null,null,null,null,null,null,{"$f":"SUM(I34:I39)","v":0}]
["Date","Miscellaneous Expenses",null,null,null,null,null,null,"Amount"]
[]
[]
[]
[]
[]
["TOTAL MISCELLANEOUS",null,null,null,null,null,null,null,{"$f":"SUM(I42:I46)","v":0}]
["Note:  Please be sure to attach all necessary receipts, indicate travel start time on the departure date and the travel return time on the return date, and to"]
["attach program agendas (conference schedule), if applicable."]

{"sheet":"per diem tables","index":3,"n_rows":26,"n_cols":6,"rows_kept":26,"cut":false,"hidden":true,"merged":[]}
["Domestic"]
["M&IE Total","Breakfast","Lunch","Dinner","Incidentals","Column1"]
[{"$f":"SUM(Table2[[#This Row],[Breakfast]:[Dinner]])","v":50},13,14,23,0]
[{"$f":"A3*0.75","v":37.5},{"$f":"B3*0.75","v":9.75},10.5,17.25,0]
[{"$f":"SUM(Table2[[#This Row],[Breakfast]:[Dinner]])","v":54},13,15,26,0]
[{"$f":"A5*0.75","v":40.5},{"$f":"B5*0.75","v":9.75},{"$f":"C5*0.75","v":11.25},19.5,0]
[{"$f":"SUM(Table2[[#This Row],[Breakfast]:[Dinner]])","v":59},14,16,29,0]
[{"$f":"A7*0.75","v":44.25},{"$f":"B7*0.75","v":10.5},{"$f":"C7*0.75","v":12},{"$f":"D7*0.75","v":21.75},0]
[{"$f":"SUM(Table2[[#This Row],[Breakfast]:[Dinner]])","v":63},16,19,28,0]
[{"$f":"A9*0.75","v":47.25},{"$f":"B9*0.75","v":12},{"$f":"C9*0.75","v":14.25},{"$f":"D9*0.75","v":21},0]
[{"$f":"SUM(Table2[[#This Row],[Breakfast]:[Dinner]])","v":64},16,17,31,0]
[{"$f":"A11*0.75","v":48},{"$f":"B11*0.75","v":12},{"$f":"C11*0.75","v":12.75},{"$f":"D11*0.75","v":23.25},0]
[{"$f":"SUM(Table2[[#This Row],[Breakfast]:[Dinner]])","v":69},17,18,34,0]
[{"$f":"A13*0.75","v":51.75},{"$f":"B13*0.75","v":12.75},{"$f":"C13*0.75","v":13.5},{"$f":"D13*0.75","v":25.5},0]
[{"$f":"SUM(Table2[[#This Row],[Breakfast]:[Dinner]])","v":74},18,20,36,0]
[{"$f":"A15*0.75","v":55.5},{"$f":"B15*0.75","v":13.5},{"$f":"C15*0.75","v":15},{"$f":"D15*0.75","v":27},0]
[{"$f":"SUM(Table2[[#This Row],[Breakfast]:[Dinner]])","v":75},20,22,33,0]
[{"$f":"A17*0.75","v":56.25},{"$f":"B17*0.75","v":15},{"$f":"C17*0.75","v":16.5},{"$f":"D17*0.75","v":24.75},{"$f":"E17*0.75","v":0}]
[{"$f":"SUM(Table2[[#This Row],[Breakfast]:[Dinner]])","v":79},19,22,38,0]
[{"$f":"A19*0.75","v":59.25},{"$f":"B19*0.75","v":14.25},{"$f":"C19*0.75","v":16.5},{"$f":"D19*0.75","v":28.5},0]
[{"$f":"SUM(Table2[[#This Row],[Breakfast]:[Dinner]])","v":81},22,23,36,0]
[{"$f":"A21*0.75","v":60.75},{"$f":"B21*0.75","v":16.5},{"$f":"C21*0.75","v":17.25},{"$f":"D21*0.75","v":27},{"$f":"E21*0.75","v":0}]
[{"$f":"SUM(Table2[[#This Row],[Breakfast]:[Dinner]])","v":84},20,24,40,0]
[{"$f":"A23*0.75","v":63},{"$f":"B23*0.75","v":15},{"$f":"C23*0.75","v":18},{"$f":"D23*0.75","v":30},{"$f":"E23*0.75","v":0}]
[{"$f":"SUM(Table2[[#This Row],[Breakfast]:[Dinner]])","v":87},23,26,38,0]
[{"$f":"A25*0.75","v":65.25},{"$f":"B25*0.75","v":17.25},{"$f":"C25*0.75","v":19.5},{"$f":"D25*0.75","v":28.5}]

{"sheet":"Cities","index":4,"n_rows":651,"n_cols":6,"rows_kept":651,"cut":false,"hidden":true,"merged":[]}
["FY2025 Per Diem Rates - Effective Oct 1, 2024",null,null,null,null,"Less Incidentals"]
["City,State","DESTINATION CITY","DESTINATION STATE","COUNTY","FY25 Meals","SSU Meals"]
[{"$f":"CONCATENATE(C3,\", \",B3)","v":"AL, Birmingham"},"Birmingham","AL","Jefferson",80,{"$f":"E3-5","v":75}]
["AL, Gulf Shores","Gulf Shores","AL","Baldwin",74,69]
["AL, Gulf Shores","Gulf Shores","AL","Baldwin",74,69]
[{"$f":"CONCATENATE(C6,\", \",B6)","v":"AL, Gulf Shores"},"Gulf Shores","AL","Baldwin",74,{"$f":"E6-5","v":69}]
["AL, Gulf Shores","Gulf Shores","AL","Baldwin",74,69]
[{"$f":"CONCATENATE(C8,\", \",B8)","v":"AL, Huntsville"},"Huntsville","AL","Madison",74,{"$f":"E8-5","v":69}]
["AL, Huntsville","Huntsville","AL","Madison",74,69]
[{"$f":"CONCATENATE(C10,\", \",B10)","v":"AL, Huntsville"},"Huntsville","AL","Madison",74,{"$f":"E10-5","v":69}]
["AL, Mobile","Mobile","AL","Mobile",74,69]
["AR, Hot Springs","Hot Springs","AR","Garland",68,63]
["AZ, Grand Canyon / Flagstaff","Grand Canyon / Flagstaff","AZ","Coconino / Yavapai less the city of Sedona",80,75]
[{"$f":"CONCATENATE(C14,\", \",B14)","v":"AZ, Grand Canyon / Flagstaff"},"Grand Canyon / Flagstaff","AZ","Coconino / Yavapai less the city of Sedona",80,{"$f":"E14-5","v":75}]
["AZ, Grand Canyon / Flagstaff","Grand Canyon / Flagstaff","AZ","Coconino / Yavapai less the city of Sedona",80,75]
["AZ, Kayenta","Kayenta","AZ","Navajo",74,69]
["AZ, Phoenix / Scottsdale","Phoenix / Scottsdale","AZ","Maricopa",86,81]
["AZ, Phoenix / Scottsdale","Phoenix / Scottsdale","AZ","Maricopa",86,81]
["AZ, Phoenix / Scottsdale","Phoenix / Scottsdale","AZ","Maricopa",86,81]
["AZ, Phoenix / Scottsdale","Phoenix / Scottsdale","AZ","Maricopa",86,81]
["AZ, Phoenix / Scottsdale","Phoenix / Scottsdale","AZ","Maricopa",86,81]
["AZ, Sedona","Sedona","AZ","City Limits of Sedona",92,87]
["AZ, Sedona","Sedona","AZ","City Limits of Sedona",92,87]
["AZ, Sedona","Sedona","AZ","City Limits of Sedona",92,87]
["AZ, Sedona","Sedona","AZ","City Limits of Sedona",92,87]
["AZ, Sedona","Sedona","AZ","City Limits of Sedona",92,87]
["AZ, Tucson","Tucson","AZ","Pima",80,75]
["AZ, Tucson","Tucson","AZ","Pima",80,75]
["AZ, Tucson","Tucson","AZ","Pima",80,75]
["CA, Antioch / Brentwood / Concord","Antioch / Brentwood / Concord","CA","Contra Costa",86,81]
["CA, Bakersfield / Ridgecrest","Bakersfield / Ridgecrest","CA","Kern",74,69]
[{"$f":"CONCATENATE(C32,\", \",B32)","v":"CA, Barstow / Ontario / Victorville"},"Barstow / Ontario / Victorville","CA","San Bernardino",86,{"$f":"E32-5","v":81}]
[{"$f":"CONCATENATE(C33,\", \",B33)","v":"CA, Death Valley"},"Death Valley","CA","Inyo / NAWS China Lake",80,{"$f":"E33-5","v":75}]
["CA, Eureka / Arcata / McKinleyville","Eureka / Arcata / McKinleyville","CA","Humboldt",86,81]
["CA, Eureka / Arcata / McKinleyville","Eureka / Arcata / McKinleyville","CA","Humboldt",86,81]
["CA, Eureka / Arcata / McKinleyville","Eureka / Arcata / McKinleyville","CA","Humboldt",86,81]
["CA, Fresno","Fresno","CA","Fresno",86,81]
["CA, Los Angeles","Los Angeles","CA","Los Angeles / Orange / Ventura / Edwards AFB less the city of Santa Monica",86,81]
["CA, Mammoth Lakes","Mammoth Lakes","CA","Mono",86,81]
["CA, Mammoth Lakes","Mammoth Lakes","CA","Mono",86,81]
["CA, Mammoth Lakes","Mammoth Lakes","CA","Mono",86,81]
["CA, Mill Valley / San Rafael / Novato","Mill Valley / San Rafael / Novato","CA","Marin",92,87]
["CA, Mill Valley / San Rafael / Novato","Mill Valley / San Rafael / Novato","CA","Marin",92,87]
["CA, Monterey","Monterey","CA","Monterey",92,87]
["CA, Monterey","Monterey","CA","Monterey",92,87]
["CA, Monterey","Monterey","CA","Monterey",92,87]
[{"$f":"CONCATENATE(C47,\", \",B47)","v":"CA, Monterey"},"Monterey","CA","Monterey",92,{"$f":"E47-5","v":87}]
["CA, Napa","Napa","CA","Napa",92,87]
["CA, Napa","Napa","CA","Napa",92,87]
["CA, Napa","Napa","CA","Napa",92,87]
["CA, Oakhurst","Oakhurst","CA","Madera ",80,75]
["CA, Oakland","Oakland","CA","Alameda",92,87]
["CA, Palm Springs","Palm Springs","CA","Riverside",86,81]
["CA, Palm Springs","Palm Springs","CA","Riverside",86,81]
["CA, Point Arena / Gualala","Point Arena / Gualala","CA","Mendocino",86,81]
["CA, Sacramento","Sacramento","CA","Sacramento",86,81]
["CA, San Diego","San Diego","CA","San Diego",86,81]
["CA, San Diego","San Diego","CA","San Diego",86,81]
[{"$f":"CONCATENATE(C59,\", \",B59)","v":"CA, San Diego"},"San Diego","CA","San Diego",86,36]
["CA, San Francisco","San Francisco","CA","San Francisco",92,{"$f":"E60-5","v":87}]
{"$rows_left_out":591}